{"text_format":"1","workbook":"xlsx","n_sheets":7,"sheets":["1) Instructions","2) Input Assumptions","3) Personnel","4) Non-Personnel","5) Secured Funding","6) Summary Charts","7) Summary Graphs & Discussion"],"not_rendered":{"charts":9,"images":4,"macros":1,"external_links":2,"defined_names":22,"comments":0,"pivot_tables":0},"unopened":[],"bounds":{"document_bytes":16777216,"sheet_cells":100000,"rows_first":2000,"rows_last":500,"rows_between":2000,"halvings":0,"cell_chars":16384,"cell_head_chars":4096},"cells_cut":0,"cells_raw":0,"read":"whole","date_system":"1900"}

{"sheet":"1) Instructions","index":0,"n_rows":36,"n_cols":5,"rows_kept":36,"cut":false,"hidden":false,"merged":[[35,0,35,16383],[1,0,1,12],[0,0,0,12],[18,0,18,12],[20,0,20,12],[33,0,33,12],[16,0,16,12],[3,0,3,12],[5,4,13,4],[5,5,14,5]]}
["Community-Based Organization and Health Care Partnership: What Does It Cost?"]
["Estimating the Total Cost of Partnership"]
[]
["As partnerships between healthcare and community-based organizations develop, launch, grow, and evolve, understanding cost structure throughout a partnership's lifecycle is essential to making informed decisions, planning for the future, and ensuring a sustaining funding model. This tool is intended to help your partnership estimate the total cost of partnering for up to three years. Understanding what it takes financially to partner can help you and your partner(s) stay aligned on goals, prioritize decisions, communicate with external stakeholders, and advocate for funding that covers the total cost of what it takes to achieve outcomes."]
[]
[null,null,null,null,"Considerations for Estimating Total Cost of Partnership\n"]
[]
[]
[]
[]
{"$rows_left_out":27}
{"sheet":"2) Input Assumptions","index":1,"n_rows":53,"n_cols":13,"rows_kept":53,"cut":false,"hidden":false,"merged":[[1,0,2,7],[0,0,0,7],[3,0,3,2],[4,5,23,7],[3,4,3,7],[30,4,34,7],[23,2,27,2],[4,2,9,2],[12,0,12,2],[22,0,22,2],[30,0,30,2],[28,5,28,7],[26,4,26,7],[13,2,19,2],[31,2,34,2]]}
["Input Assumptions"]
["Estimating total cost of partnership requires key assumptions about each partnering organization. Before completing the worksheets in subsequent tabs, use this worksheet to enter assumptions. Enter data only in cells containing BLUE text below. "]
[]
["Participating Organizations",null,null,null,"Funding Source"]
["Organization Name","Type","Partnership requires at least two organizations, but may include more. Use this table to list up to five partnering organization names and types. To identify partnering organizations, consider those organizations that dedicate meaningful time to partnership activities.",null,{"$f":"A6","v":"Organization Name 1"},"Partnership costs are supported by a variety of funding sources. Some funding may be contributed directly from partnering organizations, whereas other funding is secured from external sources. Use this table to list partnership funding sources. Examples of common funding sources include: foundation grants, corporate sponsorships, individual donations, local government, state government, federal government, health system contracts, insurance reimbursement, Medicaid/Medicare funds, and settlement funds."]
["Organization Name 1","Enter organization type",null,null,{"$f":"A7","v":"Organization Name 2"}]
["Organization Name 2","Enter organization type",null,null,"Organization Name 3",null,null,null,null,null,null," "]
["Organization Name 3","Enter organization type",null,null,"Organization Name 4"]
["Organization Name 4","Enter organization type",null,null,"Organization Name 5"]
["Organization Name 5","Enter organization type",null,null,"Funding Source 1"]
{"$rows_left_out":44}
{"sheet":"3) Personnel","index":2,"n_rows":45,"n_cols":14,"rows_kept":45,"cut":false,"hidden":false,"merged":[[5,13,8,13],[3,1,4,12],[1,0,2,12],[0,0,0,12],[3,0,4,0],[5,0,38,0],[7,4,8,4],[7,3,8,3],[7,2,8,2],[7,1,8,1],[8,7,8,8],[8,9,8,10],[8,11,8,12],[7,7,7,12],[7,5,8,5],[7,6,8,6],[5,1,6,1],[5,2,6,2],[5,4,6,4],[5,3,6,3],[5,7,6,12],[5,6,6,6],[5,5,6,5]]}
["Personnel Costs"]
["Partnerships are driven by people, which often represent a significant cost. This worksheet will help you identify personnel-related costs of partnership, including wage and benefit costs at each partnering organization and payments to consultants and/or contractors. Data from this worksheet, along with information from the Input Assumptions tab, will guide a calculation of your partnership's personnel costs in the Summary Tab. Enter data only in cells containing BLUE text below. "]
[]
["Estimating Personnel Costs","Worksheet"]
[]
["\n1) Who is involved in partnership activities? \nList the title in Column B and organization in Column C of each person spending time on partnership activities in each of up to three years. Consider individuals who are involved in direct service delivery, as well as those involved in administrative or strategic partnership functions. \n\nIn addition to those directly employed by each partnering organization, include consultants or contractors the partnership utilizes in each of up to three years. List the organization funding this consultant/contractor in Column C.\n\nFor example, in addition to case managers and nurses, your partnership may involve an administrative assistant who spends time coordinating schedules, executive directors at each organization who meet monthly to discuss strategic direction, and a development consultant who spends time fundraising for the partnership. Each of these individuals should be listed in the worksheet.\n \n2) What is each individual's base salary or payment? Does this individual receive fringe benefits?\nEnter each individual's annual base salary or payment amount in Column D.\n\nFor part-time or hourly employees, enter real annual salary, rather than a full-time equivalent salary.\n\nIn Column E, select whether or not (Yes/No) this person receives fringe benefits. For more information about fringe benefits, see the Input Assumptions tab.\n\n3) Is this individual needed by the partnership on a one-time or ongoing basis?\nIn Column F, indicate whether each individual listed supports the partnership on a one-time or ongoing basis. Select \"one-time\" for individuals only needed by the partnership as it is developing or changing and \"ongoing\" for individuals needed by the partnership each year on a regular basis.\n\n4) Is this individual's salary or payment a cash (funded) or in-kind cost?\nFor each individual listed, indicate in Column G whether this person's wages or payment are a cash (funded) cost or an in-kind contribution to the partnership, donated by the partnering organization listed in Column C.\n\n5) What portion of each individual's time is spent on partnership activities over the course of three years? \nFor each individual listed, estimate average time spent on partnership activities as a percentage of total annual time in each of up to 3 years in Columns H, J, and L. If the individual is needed on a one-time basis, only estimate time allocation in the year(s) that person is working on partnership activities. If the individual is needed by the partnership on an ongoing basis, estimate average time spent each year, taking into consideration evolving partnership needs.\n\nFor example, as your partnership is in its first year and making decisions about future strategy, your executive director may need to spend more time on partnership activities than in subsequent years. This individual's time allocated to the partnership would likely be higher in Year 1 than in Years 2 and 3.","Enter employee, consultant, or contractor title","From the drop-down menu, select organization that employs this individual; for consultants or contractors, select organization that pays this individual","Enter individual's Year 1 base salary or payment","From the drop-down menu, select whether or not this individual receives fringe benefits","From the drop-down menu, select whether this individual is needed on a one-time or ongoing basis","From the drop-down menu, select whether this item is a cash (funded) or in-kind cost","Estimate average time spent on partnership activities as a percentage of total annual time, in each of up to 3 years",null,null,null,null,null,"Notes"]
[]
[null,"Title","Organization (dropdown)","Base Salary or Payment","Fringe (dropdown)","One-Time or Ongoing (dropdown)","Cash or In-Kind (dropdown)","Time Allocation %"]
[null,null,null,null,null,null,null,"Year 1",null,"Year 2",null,"Year 3"]
[null,"Title 1",null,0,null,null,null,0,{"$f":"D10*H10","v":0},0,{"$f":"D10*J10*(1+'2) Input Assumptions'!$B$32)","v":0},0,{"$f":"D10*L10*(1+'2) Input Assumptions'!$B$32)^2","v":0}]
{"$rows_left_out":36}
{"sheet":"4) Non-Personnel","index":3,"n_rows":45,"n_cols":12,"rows_kept":45,"cut":false,"hidden":false,"merged":[[5,8,7,8],[0,0,0,7],[1,0,2,7],[3,0,4,0],[3,1,4,7],[5,0,37,0],[6,1,7,1],[6,2,7,2],[5,5,6,7],[6,3,7,3],[6,4,7,4]]}
["Non-Personnel Costs"]
["In addition to people, partnerships require space, systems, supplies, and other supports. This worksheet will help you identify non-personnel costs directly tied to your partnership. Data from this worksheet, along with information from the Input Assumptions tab, will guide a calculation of your partnership's non-personnel costs in the Summary Tab. Enter data only in cells containing BLUE text below. "]
[]
["Estimating Non-Personnel Costs","Worksheet"]
[]
["\n1) Other than personnel, what costs are directly attributed to the partnership?\nTo determine which costs are directly tied to the partnership, ask yourself: \"If the partnership did not exist, would this cost item go away?\" If the answer is \"yes,\" that item should be listed in this worksheet in Column B, along with the organization that incurs the cost in Column C. If the answer is \"no,\" that cost is likely a shared organizational cost. Rather than listing it in this worksheet, it will be captured through each organization's indirect cost rate listed in the Input Assumptions tab. \n\nFor example, your organization rents office space for all of its staff, as well as a meeting room for services delivered through the partnership. If the partnership did not exist, your organization would still need office space, but not the extra meeting room. In this example, only the meeting room is directly attributed to the partnership and would be listed on this worksheet.\n\nWhile specific cost items are unique to each partnership, common costs are listed below:\n\nOccupancy costs: rent, utilities, mortgage payments, depreciation, equipment rental, maintenance, property insurance, real estate taxes, security\nData & Technology costs: software, hardware, licenses, IT support, feasibility studies, evaluation expenses\nSupport costs: travel, training, telephone, supplies, printing, meeting expenses, conferences, board expenses, education & outreach, legal fees, subgrants, membership dues, office expenses, postage, production, advertising, recruitment, registration, shipping, subscriptions\n\n2) Is this cost item needed by the partnership one-time or on an ongoing basis?\nFor each cost item listed, indicate in Column D whether it is needed on a one-time or ongoing basis. Select \"one-time\" for cost items only needed by the partnership as it is developing or changing and \"ongoing\" for items needed by the partnership each year on a regular basis.\n\n3) Is this a cash (funded) or in-kind cost?\nFor each cost item listed, indicate in Column E whether this item is a cash (funded) cost or an in-kind contribution to the partnership, donated by the partnering organization listed in Column C.\n\n4) What is the cost amount in each of up to three years?\nFor each item listed, estimate cost in each of up to 3 years in Columns F, G, and H. If the item is a one-time cost, only list an amount in the year(s) the cost is incurred. If the cost item is ongoing, estimate the amount incurred each year, taking into consideration factors such as inflation and evolving partnership needs. \n\nFor example, as your partnership is launching, you may need to purchase a software system. This would be considered a one-time cost because you only need to make this purchase once, and the amount would be listed only in Year 1. However, your partnership may also need annual licenses to operate this system. Because license costs are incurred each year, this is an ongoing cost item, and the licensing fee amount would be listed in Years 1, 2, and 3.","Enter non-personnel cost item","From the drop-down menu, select organization that incurs this cost","From the drop-down menu, select whether this item is incurred on a one-time or ongoing basis","From the drop-down menu, select whether this item is a cash (funded) or in-kind cost","Estimate annual cost in each of up to 3 years; consider factors such as inflation and evolving partnership needs in determining yearly cost",null,null," Notes"]
[null,"Cost Item","Organization (dropdown)","One-Time or Ongoing (dropdown)","Cash or In-Kind (dropdown)"]
[null,null,null,null,null,"Year 1","Year 2","Year 3"]
[null,"Cost Item 1",null,null,null,0,0,0," "]
[null,"Cost Item 2",null,null,null,0,0,0]
{"$rows_left_out":36}
{"sheet":"5) Secured Funding","index":4,"n_rows":33,"n_cols":8,"rows_kept":33,"cut":false,"hidden":false,"merged":[[32,2,32,3],[5,6,7,6],[3,0,4,0],[0,0,0,5],[1,0,2,5],[6,2,7,2],[3,1,4,5],[5,3,6,5],[6,1,7,1],[5,0,27,0]]}
["Secured Partnership Funding"]
["Partnerships rely on a variety of funding sources to cover their costs. This worksheet is intended to consolidate secured funding that supports partnership costs. Data from this worksheet will guide a calculation of the partnership's confirmed funding and funding surplus/gap in the Summary Tab. Enter data only in cells containing BLUE text below."]
[null,null,null,null,null,null," "]
["Estimating Partnership Funding","Worksheet"]
[]
["\n1) What funding sources have been secured to support the partnership?\nSelect secured partnership funding source in Column B. The funding source drop-down can be updated in the Input Assumptions tab. Include only funding sources that have been confirmed and not those that are speculative or planned.\n\nAdd any relevant notes in Column C, such as information about the specific funder or restrictions tied to this funding.\n\n2) For each source, input confirmed amount of funding in each of up to 3 years.\nList funding amount in Columns D, E, and F. If the funding source is one-time or episodic in nature, list amount only in the year(s) for which the funding is intended. For funding sources that provide ongoing revenue, list amount confirmed in each year. \n\nFor example, as your partnership is launching, you may receive a two-year grant to support development. For this funding source, amounts would be listed in Years 1 and 2. You may also receive annual funding through a state contract. For this funding source, amounts would be listed in Years 1, 2, and 3.\n\n3) Check that total secured funding approximately matches total cash (funded) costs.\nAfter entering all secured funding, check whether total secured funding in Row 30 approximately matches total cash partnership costs in Row 32.\n\nIf the two totals differ significantly, check that you have correctly entered all secured funding and that all costs on the personnel and non-personnel tabs have been input and appropriately categorized as cash or in-kind.","From the drop-down menu, select funding source","Enter relevant notes about this funding source","Estimate secured funding amount in each of up to 3 years",null,null,"Notes"]
[null,"Funding Source (dropdown)","Funding Source Notes"]
[null,null,null,"Year 1","Year 2","Year 3"]
[null,null,null,0,0,0]
[null,null,null,0,0,0]
{"$rows_left_out":24}
{"sheet":"6) Summary Charts","index":5,"n_rows":78,"n_cols":24,"rows_kept":78,"cut":false,"hidden":false,"merged":[[71,15,71,22],[72,15,77,15],[57,15,57,22],[51,15,56,15],[58,15,63,15],[64,15,64,22],[65,15,70,15],[1,23,2,25],[44,15,49,15],[50,15,50,22],[43,15,43,16],[27,15,32,15],[34,15,39,15],[43,17,43,18],[43,19,43,20],[43,21,43,22],[5,17,5,18],[5,19,5,20],[5,21,5,22],[6,15,11,15],[13,15,18,15],[12,15,12,22],[19,15,19,22],[38,2,39,2],[38,3,38,5],[38,6,38,8],[38,9,38,11],[15,2,16,2],[15,3,15,4],[15,5,15,6],[15,7,15,8],[26,2,27,2],[26,3,26,5],[26,6,26,8],[26,15,26,22],[20,15,25,15],[33,15,33,22],[1,0,1,12],[5,3,5,5],[5,6,5,8],[5,9,5,11],[5,2,6,2],[26,9,26,11],[3,15,3,16]]}
[]
["Partnership Summary Charts",null,null,null,null,null,null,null,null,null,null,null,null,null,null,null,null,null,null,null,null,null,null,"Click (+) to see additional details related to summary chart calculations "]
[]
[null,null,"Total Cost of Partnership \n",null,null,null,null,null,null,null,null,null,null,null,null,"Cost Summary Details\n"]
[null,null,"Personnel and Non-Personnel Costs ",null,null,null,null,null,null,null,null,null,null,null,null,"One-time vs Ongoing Costs "]
[null,null,"Total Cost\n(includes direct and indirect costs)","Year 1",null,null,"Year 2 ",null,null,"Year 3",null,null,null,null,null,null,null,"Year 1",null,"Year 2 ",null,"Year 3 "]
[null,null,null,"Personnel","Non-Personnel","Total Cost","Personnel","Non-Personnel","Total Cost","Personnel","Non-Personnel","Total Cost",null,null,null,{"$f":"C41","v":"Organization Name 1"},null,"One-Time","Ongoing","One-Time","Ongoing","One-Time","Ongoing"]
[null,null,{"$f":"'2) Input Assumptions'!A6","v":"Organization Name 1"},{"$f":"(D18+E18)*(1+'2) Input Assumptions'!B14)","v":0},{"$f":"SUMIF('4) Non-Personnel'!$C$9:$C$38,'2) Input Assumptions'!A6,'4) Non-Personnel'!$F$9:$F$38)*(1+'2) Input Assumptions'!B14)","v":0},{"$f":"SUM(D8:E8)","v":0},{"$f":"(F18+G18)*(1+'2) Input Assumptions'!B14)","v":0},{"$f":"SUMIF('4) Non-Personnel'!$C$9:$C$38,'2) Input Assumptions'!A6,'4) Non-Personnel'!$G$9:$G$38)*(1+'2) Input Assumptions'!B14)","v":0},{"$f":"(SUM(G8:H8))","v":0},{"$f":"(H18+I18)*(1+'2) Input Assumptions'!B14)","v":0},{"$f":"SUMIF('4) Non-Personnel'!$C$9:$C$38,'2) Input Assumptions'!A6,'4) Non-Personnel'!$H$9:$H$38)*(1+'2) Input Assumptions'!B14)","v":0},{"$f":"(SUM(J8:K8))","v":0},null,null,null,null,"Wages",{"$f":"SUMIFS('3) Personnel'!$I$10:$I$39,'3) Personnel'!$F$10:$F$39,\"one-time\",'3) Personnel'!$C$10:$C$39,\"*\"&$C$41&\"*\")","v":0},{"$f":"SUMIFS('3) Personnel'!$I$10:$I$39,'3) Personnel'!$F$10:$F$39,\"ongoing\",'3) Personnel'!$C$10:$C$39,\"*\"&$C$41&\"*\")","v":0},{"$f":"SUMIFS('3) Personnel'!$K$10:$K$39,'3) Personnel'!$F$10:$F$39,\"one-time\",'3) Personnel'!$C$10:$C$39,\"*\"&$C$41&\"*\")","v":0},{"$f":"SUMIFS('3) Personnel'!$K$10:$K$39,'3) Personnel'!$F$10:$F$39,\"ongoing\",'3) Personnel'!$C$10:$C$39,\"*\"&$C$41&\"*\")","v":0},{"$f":"SUMIFS('3) Personnel'!$M$10:$M$39,'3) Personnel'!$F$10:$F$39,\"one-time\",'3) Personnel'!$C$10:$C$39,\"*\"&$C$41&\"*\")","v":0},{"$f":"SUMIFS('3) Personnel'!$M$10:$M$39,'3) Personnel'!$F$10:$F$39,\"ongoing\",'3) Personnel'!$C$10:$C$39,\"*\"&$C$41&\"*\")","v":0}]
[null,null,{"$f":"'2) Input Assumptions'!A7","v":"Organization Name 2"},{"$f":"(D19+E19)*(1+'2) Input Assumptions'!B15)","v":0},{"$f":"SUMIF('4) Non-Personnel'!$C$9:$C$38,'2) Input Assumptions'!A7,'4) Non-Personnel'!$F$9:$F$38)*(1+'2) Input Assumptions'!B15)","v":0},{"$f":"SUM(D9:E9)","v":0},{"$f":"(F19+G19)*(1+'2) Input Assumptions'!B15)","v":0},{"$f":"SUMIF('4) Non-Personnel'!$C$9:$C$38,'2) Input Assumptions'!A7,'4) Non-Personnel'!$G$9:$G$38)*(1+'2) Input Assumptions'!B15)","v":0},{"$f":"(SUM(G9:H9))","v":0},{"$f":"(H19+I19)*(1+'2) Input Assumptions'!B15)","v":0},{"$f":"SUMIF('4) Non-Personnel'!$C$9:$C$38,'2) Input Assumptions'!A7,'4) Non-Personnel'!$H$9:$H$38)*(1+'2) Input Assumptions'!B15)","v":0},{"$f":"(SUM(J9:K9))","v":0},null,null,null,null,"Fringe",{"$f":"('2) Input Assumptions'!$B$24*SUMIFS('3) Personnel'!$I$10:$I$39,'3) Personnel'!$F$10:$F$39,\"one-time\",'3) Personnel'!$E$10:$E$39,\"yes\",'3) Personnel'!$C$10:$C$39,\"*\"&$C$41&\"*\"))","v":0},{"$f":"(('2) Input Assumptions'!$B$24*SUMIFS('3) Personnel'!$I$10:$I$39,'3) Personnel'!$F$10:$F$39,\"ongoing\",'3) Personnel'!$E$10:$E$39,\"yes\",'3) Personnel'!$C$10:$C$39,\"*\"&$C$41&\"*\")))","v":0},{"$f":"('2) Input Assumptions'!$B$24*SUMIFS('3) Personnel'!$K$10:$K$39,'3) Personnel'!$F$10:$F$39,\"one-time\",'3) Personnel'!$E$10:$E$39,\"yes\",'3) Personnel'!$C$10:$C$39,\"*\"&$C$41&\"*\"))","v":0},{"$f":"('2) Input Assumptions'!$B$24*SUMIFS('3) Personnel'!$K$10:$K$39,'3) Personnel'!$F$10:$F$39,\"ongoing\",'3) Personnel'!$E$10:$E$39,\"yes\",'3) Personnel'!$C$10:$C$39,\"*\"&$C$41&\"*\"))","v":0},{"$f":"('2) Input Assumptions'!$B$24*SUMIFS('3) Personnel'!$M$10:$M$39,'3) Personnel'!$F$10:$F$39,\"one-time\",'3) Personnel'!$E$10:$E$39,\"yes\",'3) Personnel'!$C$10:$C$39,\"*\"&$C$41&\"*\"))","v":0},{"$f":"('2) Input Assumptions'!$B$24*SUMIFS('3) Personnel'!$M$10:$M$39,'3) Personnel'!$F$10:$F$39,\"ongoing\",'3) Personnel'!$E$10:$E$39,\"yes\",'3) Personnel'!$C$10:$C$39,\"*\"&$C$41&\"*\"))","v":0}]
[null,null,{"$f":"'2) Input Assumptions'!A8","v":"Organization Name 3"},{"$f":"(D20+E20)*(1+'2) Input Assumptions'!B16)","v":0},{"$f":"SUMIF('4) Non-Personnel'!$C$9:$C$38,'2) Input Assumptions'!A8,'4) Non-Personnel'!$F$9:$F$38)*(1+'2) Input Assumptions'!B16)","v":0},{"$f":"SUM(D10:E10)","v":0},{"$f":"(F20+G20)*(1+'2) Input Assumptions'!B16)","v":0},{"$f":"SUMIF('4) Non-Personnel'!$C$9:$C$38,'2) Input Assumptions'!A8,'4) Non-Personnel'!$G$9:$G$38)*(1+'2) Input Assumptions'!B16)","v":0},{"$f":"(SUM(G10:H10))","v":0},{"$f":"(H20+I20)*(1+'2) Input Assumptions'!B16)","v":0},{"$f":"SUMIF('4) Non-Personnel'!$C$9:$C$38,'2) Input Assumptions'!A8,'4) Non-Personnel'!$H$9:$H$38)*(1+'2) Input Assumptions'!B16)","v":0},{"$f":"(SUM(J10:K10))","v":0},null,null,null,null,"Non-Personnel Costs ",{"$f":"SUMIFS('4) Non-Personnel'!$F$9:$F$38,'4) Non-Personnel'!$D$9:$D$38,\"one-time\",'4) Non-Personnel'!$C$9:$C$38,\"*\"&$C$41&\"*\")","v":0},{"$f":"SUMIFS('4) Non-Personnel'!$F$9:$F$38,'4) Non-Personnel'!$D$9:$D$38,\"ongoing\",'4) Non-Personnel'!$C$9:$C$38,\"*\"&$C$41&\"*\")","v":0},{"$f":"SUMIFS('4) Non-Personnel'!$G$9:$G$38,'4) Non-Personnel'!$D$9:$D$38,\"one-time\",'4) Non-Personnel'!$C$9:$C$38,\"*\"&$C$41&\"*\")","v":0},{"$f":"SUMIFS('4) Non-Personnel'!$G$9:$G$38,'4) Non-Personnel'!$D$9:$D$38,\"ongoing\",'4) Non-Personnel'!$C$9:$C$38,\"*\"&$C$41&\"*\")","v":0},{"$f":"SUMIFS('4) Non-Personnel'!$H$9:$H$38,'4) Non-Personnel'!$D$9:$D$38,\"one-time\",'4) Non-Personnel'!$C$9:$C$38,\"*\"&$C$41&\"*\")","v":0},{"$f":"SUMIFS('4) Non-Personnel'!$H$9:$H$38,'4) Non-Personnel'!$D$9:$D$38,\"ongoing\",'4) Non-Personnel'!$C$9:$C$38,\"*\"&$C$41&\"*\")","v":0}]
{"$rows_left_out":69}
{"sheet":"7) Summary Graphs & Discussion","index":6,"n_rows":79,"n_cols":8,"rows_kept":79,"cut":false,"hidden":false,"merged":[[1,0,1,11],[78,7,78,11],[79,7,101,11]]}
[]
["Partnership Summary Graphs & Discussion"]
[]
[]
[]
[]
[]
[]
[]
[]
{"$rows_left_out":69}